{"text_format":"1","workbook":"xlsx","n_sheets":8,"sheets":["Auftragsdaten","Arbeitsgeräte","Mitarbeiter","Technischer Bericht","Konfiguration","Playground","Template","Listen"],"not_rendered":{"charts":0,"images":3,"macros":1,"external_links":0,"defined_names":12,"comments":0,"pivot_tables":0},"unopened":[],"bounds":{"document_bytes":16777216,"sheet_cells":100000,"rows_first":2000,"rows_last":500,"rows_between":2000,"halvings":0,"cell_chars":16384,"cell_head_chars":4096},"cells_cut":0,"cells_raw":0,"read":"whole","date_system":"1900"}

{"sheet":"Auftragsdaten","index":0,"n_rows":41,"n_cols":7,"rows_kept":41,"cut":false,"hidden":false,"merged":[[23,1,23,3],[24,2,24,3],[25,2,25,3],[26,2,26,3],[44,0,44,11],[45,0,45,11],[46,0,48,11],[32,1,32,3],[33,1,33,3],[34,2,34,3],[28,0,28,3],[29,1,29,3],[30,0,31,0],[30,1,30,3],[31,1,31,3],[27,0,27,3],[27,6,27,11],[0,12,48,12],[11,0,11,3],[19,0,19,3],[11,6,11,11],[19,6,19,11],[43,0,43,11],[10,0,10,1],[10,2,10,3],[35,2,35,3],[0,0,1,11],[39,0,39,11],[36,0,36,11],[2,5,35,5],[2,6,2,11],[2,0,2,3],[42,0,42,11],[38,0,38,1],[38,2,38,11],[40,0,40,11],[41,0,41,11],[37,0,37,11],[3,0,3,3],[3,6,3,11],[9,2,9,3],[5,0,5,1],[6,0,6,1],[4,0,4,1],[7,0,7,1],[8,0,8,1],[9,0,9,1],[4,2,4,3],[5,2,5,3],[6,2,6,3],[7,2,7,3],[8,2,8,3],[10,6,10,7],[4,8,4,11],[5,8,5,11],[6,8,6,11],[7,8,7,11],[8,8,8,11],[9,8,9,11],[10,8,10,11],[4,6,4,7],[5,6,5,7],[6,6,6,7],[7,6,7,7],[8,6,8,7],[9,6,9,7],[12,0,12,3],[12,6,12,11],[13,1,13,3],[14,1,14,3],[17,8,17,11],[18,8,18,11],[14,6,15,6],[14,0,15,0],[16,0,18,0],[16,6,18,6],[17,2,17,3],[18,2,18,3],[15,1,15,3],[16,2,16,3],[15,7,15,11],[16,8,16,11],[13,7,13,11],[14,7,14,11],[20,0,20,3],[22,0,23,0],[24,0,26,0],[35,7,35,11],[32,6,34,6],[32,8,32,11],[33,8,33,11],[34,8,34,11],[28,6,28,11],[29,7,29,11],[30,6,31,6],[30,7,30,11],[31,7,31,11],[20,6,20,11],[22,6,23,6],[24,6,26,6],[21,7,21,11],[22,7,22,11],[23,7,23,11],[24,8,24,11],[25,8,25,11],[26,8,26,11],[21,1,21,3],[22,1,22,3]]}
["Auftragsdatenblatt"]
[]
[]
["Auftragsdaten",null,null,null,null,null,"Schadendetails"]
["Auftragsdatum ",null,null,null,null,null,"Schadendatum "]
["Auftragsnummer",null,null,null,null,null,"Schadennummer "]
["Auftragsart ",null,null,null,null,null,"Sparte "]
["Auftragsstatus ",null,null,null,null,null,"Schadenort "]
["Sachbearbeiter ",null,"Mitarbeiter 2",null,null,null,"Schadenart "]
["Telefon ",null,{"$f":"IFERROR(VLOOKUP(C9,Mitarbeiter!A2:F11,2,FALSE),0)","v":"+41 79 1234568"},null,null,null,"Schadenursache "]
["Email",null,{"$f":"IFERROR(VLOOKUP(C9,Mitarbeiter!A2:F11,3,FALSE),0)","v":"ma2@example.com"},null,null,null,"Policennummer "]
[]
["Versicherungsnehmer",null,null,null,null,null,"Antragsteller"]
["Name",null,null,null,null,null,"Name"]
["Anschrift",null,null,null,null,null,"Anschrift"]
[]
["Kontakt",null,null,null,null,null,"Kontakt"]
[]
[]
[]
["Versicherung",null,null,null,null,null,"Leasingnehmer"]
["Name",null,null,null,null,null,"Name"]
["Anschrift",null,null,null,null,null,"Anschrift"]
[]
["Kontakt",null,null,null,null,null,"Kontakt"]
[]
[]
[]
["Schadenobjekt",null,null,null,null,null,"Ansprechpartner"]
["Name",null,null,null,null,null,"Name"]
["Anschrift",null,null,null,null,null,"Anschrift"]
[]
["Haustyp",null,null,null,null,null,"Kontakt"]
["Etage"]
["Aufzug vorh.",null,1]
["Vorsteuerabz.",null,null,null,null,null,"Funktion"]
[]
["Schadensbeschreibung"]
["Beschreibung"]
[]
["Sonstige Bemerkungen und Notizen"]

{"sheet":"Arbeitsgeräte","index":1,"n_rows":18,"n_cols":8,"rows_kept":18,"cut":false,"hidden":true,"merged":[]}
["Bezeichnung","Geräteart","Gerätenummer","Kapazität/24h","Verbrauch","Verbrauch/24h","Gewicht","Preis"]
["TTK 100",null,null,20,0.35,8.3999999999999986,26,0]
["TTK 100S",null,null,20,0.62,14.88,26,0]
["TTK 105S",null,null,28,0.52,12.48,14.9,0]
["TTK 140S",null,null,35,0.66,15.84,30.5,0]
["TTK 150",null,null,30,0.65,15.6,29,0]
["TTK 175S",null,null,50,0.88,21.12,35,0]
["TTK 300",null,null,60,0.98,23.52,41,0]
["TTK 400",null,null,75,1.4,33.599999999999994,42,0]
["TTK 600",null,null,120,1.73,41.52,61,0]
["TTV 4500",null,null,null,0.23,5.5200000000000005,12.5,0]
["TTV 4500S",null,null,null,0.32500000000000001,7.8,15,0]
["TFV10S",null,null,null,0.1,2.4000000000000004,3.5,0]
["TFV30S",null,null,null,1.2,28.799999999999997,15,0]
["Qube",null,null,null,1.2,28.799999999999997,27,0]
["VE 4",null,null,null,1.1000000000000001,26.4,29.5,0]
["VX 5",null,null,null,1.2,28.799999999999997,11,0]
["WA 4",null,null,null,null,0,18,0]

{"sheet":"Mitarbeiter","index":2,"n_rows":11,"n_cols":6,"rows_kept":11,"cut":false,"hidden":true,"merged":[]}
["Name","Telefon","Email","Eigenschaft 3","Eigenschaft 4","Eigenschaft 5"]
["Mitarbeiter 1","+41 79 1234567","ma1@example.com"]
["Mitarbeiter 2","+41 79 1234568","ma2@example.com"]
["Mitarbeiter 3","+41 79 1234569","ma3@example.com"]
["Mitarbeiter 4","+41 79 1234570","ma4@example.com"]
["Mitarbeiter 5","+41 79 1234571","ma5@example.com"]
["Mitarbeiter 6","+41 79 1234572","ma6@example.com"]
["Mitarbeiter 7","+41 79 1234573","ma7@example.com"]
["Mitarbeiter 8","+41 79 1234574","ma8@example.com"]
["Mitarbeiter 9","+41 79 1234575","ma9@example.com"]
["Mitarbeiter 10","+41 79 1234576","ma10@example.com"]

{"sheet":"Technischer Bericht","index":3,"n_rows":207,"n_cols":9,"rows_kept":207,"cut":false,"hidden":false,"merged":[[123,0,123,9],[19,1,19,3],[20,1,20,3],[120,5,121,9],[21,0,23,0],[21,2,21,3],[22,2,22,3],[23,2,23,3],[21,5,23,5],[21,7,21,9],[22,7,22,9],[13,7,13,9],[23,7,23,9],[17,0,17,3],[18,1,18,3],[19,0,20,0],[15,2,15,3],[17,5,17,9],[18,6,18,9],[19,5,20,5],[19,6,19,9],[20,6,20,9],[0,5,1,9],[3,0,3,3],[4,0,4,3],[3,8,3,9],[11,0,12,0],[13,0,15,0],[9,0,9,3],[4,8,4,9],[5,8,5,9],[7,0,7,9],[5,0,5,3],[14,7,14,9],[15,7,15,9],[11,5,12,5],[13,5,15,5],[10,1,10,3],[11,1,11,3],[12,1,12,3],[13,2,13,3],[14,2,14,3],[10,6,10,9],[9,5,9,9],[11,6,11,9],[12,6,12,9],[81,1,81,9],[82,1,82,9],[75,1,75,9],[76,1,76,9],[77,1,77,9],[60,5,61,9],[63,0,63,9],[66,2,71,9],[66,0,71,1],[73,0,73,9],[74,1,74,9],[96,3,96,5],[96,8,96,9],[97,3,97,5],[64,0,64,9],[62,0,62,9],[72,0,72,9],[83,0,83,9],[92,2,92,7],[93,2,93,7],[86,0,86,1],[87,0,87,1],[88,0,88,1],[89,0,89,1],[90,0,90,1],[91,0,91,1],[92,0,92,1],[93,0,93,1],[86,8,86,9],[87,8,87,9],[88,8,88,9],[89,8,89,9],[90,8,90,9],[91,8,91,9],[92,8,92,9],[2,0,2,9],[3,4,5,6],[6,0,6,9],[8,0,8,9],[16,0,16,9],[9,4,15,4],[17,4,23,4],[95,0,95,9],[94,0,94,9],[93,8,93,9],[86,2,86,7],[87,2,87,7],[88,2,88,7],[89,2,89,7],[90,2,90,7],[91,2,91,7],[65,0,65,9],[84,0,84,9],[85,8,85,9],[85,0,85,1],[85,2,85,7],[78,1,78,9],[79,1,79,9],[80,1,80,9],[126,0,126,9],[124,2,124,4],[120,0,121,4],[60,0,61,4],[0,0,1,4],[124,5,124,9],[125,0,125,3],[125,5,125,9],[122,0,122,9],[103,3,103,5],[104,3,104,5],[97,8,97,9],[98,8,98,9],[99,8,99,9],[100,8,100,9],[101,8,101,9],[102,8,102,9],[103,8,103,9],[104,8,104,9],[98,3,98,5],[99,3,99,5],[100,3,100,5],[101,3,101,5],[102,3,102,5],[206,2,206,4],[206,5,206,9],[207,0,207,3],[207,5,207,9],[208,0,208,9],[203,2,203,4],[203,5,203,9],[204,0,204,3],[204,5,204,9],[205,0,205,9]]}
["Technischer Bericht"]
[]
[]
[{"$f":"Auftragsdaten!$B$30","v":0},null,null,null,null,null,null,"Projekt","Aquaproject"]
[{"$f":"Auftragsdaten!$B$31","v":0},null,null,null,null,null,null,"Datum",{"$f":"TODAY()","v":45492}]
[{"$f":"Auftragsdaten!$B$32","v":0},null,null,null,null,null,null,"Verantwortlich",{"$f":"Auftragsdaten!$C$9","v":"Mitarbeiter 2"}]
[]
["Stammdaten"]
[]
["Antragsteller",null,null,null,null,"Eigentümer"]
["Name",null,null,null,null,"Name"]
["Anschrift",null,null,null,null,"Anschrift"]
[]
["Kontakt",null,null,null,null,"Kontakt"]
[]
[]
[]
["Leasingnehmer",null,null,null,null,"Versicherung"]
["Name",null,null,null,null,"Name"]
["Anschrift",null,null,null,null,"Anschrift"]
[]
["Kontakt",null,null,null,null,"Kontakt"]
[]
[]
[]
[]
[]
[]
[]
[]
[]
[]
[]
[]
[]
[]
[]
[]
[]
[]
[]
[]
[]
[]
[]
[]
[]
[]
[]
[]
[]
[]
[]
[]
[]
[]
[]
[]
[]
[]
["Technischer Bericht"]
[]
[]
["Aktivitäten"]
[]
["Ausgangssituation"]
["Kurzbeschreibung",null,{"$f":"Auftragsdaten!$C$39","v":0}]
[]
[]
[]
[]
[]
[]
["Interventionsphasen"]
["Datum","Art der Intervention"]
[]
[]
[]
[]
[]
[]
[]
[]
[]
["Untersuchte Bereiche"]
["Bereich",null,"Beschreibung",null,null,null,null,null,"Bilder"]
[]
[]
[]
[]
[]
[]
[]
[]
[]
["Mapping (Messung der Feuchtigkeitskontaktpunkte mit dem T3000-Dielektrikum)"]
["Bereich","Digit (v. mx)","Punkt","Material",null,null,"Digit (v. mx)","Punkt","Material"]
[]
[]
[]
[]
[]
[]
[]
[]
[]
[]
[]
[]
[]
[]
[]
[]
[]
[]
[]
[]
[]
[]
[]
["Technischer Bericht"]
[]
[]
["Fotos"]
["Bild-Nummer",1,null,null,null,"Beschreibung"]
[]
[]
[]
[]
[]
[]
[]
[]
[]
[]
[]
[]
[]
[]
[]
[]
[]
[]
[]
[]
[]
[]
[]
[]
[]
[]
[]
[]
[]
[]
[]
[]
[]
[]
[]
[]
[]
[]
[]
[]
[]
[]
[]
[]
[]
[]
[]
[]
[]
[]
[]
[]
[]
[]
[]
[]
[]
[]
[]
[]
[]
[]
[]
[]
[]
[]
[]
[]
[]
[]
[]
[]
[]
[]
[]
[]
[]
[]
["Bild-Nummer",1,null,null,null,"Beschreibung"]
[]
[]
["Bild-Nummer",1,null,null,null,"Beschreibung"]

{"sheet":"Konfiguration","index":4,"n_rows":5,"n_cols":6,"rows_kept":5,"cut":false,"hidden":false,"merged":[]}
["Bezeichnung","Wert","Beschreibung",null,"Aktion","Beschreibung"]
["Projekt-Wurzelverzeichnis","C:\\Users\\Zerano Fimdon\\OneDrive - NEBA Unternehmungen AG\\Dokumente\\","Stammverzeichnis für alle Projekte. Der Pfad sollte zu einem OneDrive-Verzeichnis zeigen, in dem alle Projekte abgelegt sind. Diese Einstellung wird beim Öffnen der Datei automatisch gesetzt.",null,null,"Legt die Standard-Ordnerstruktur im Projektverzeichnis an"]
["Projekt-Ordner","Cockpit","Name des Projektordners im Stammverzeichnis. Diese Einstellung wird beim Öffnen der Datei automatisch gesetzt."]
["Unterordner Bilder","Bilder","Unterordner im Projektverzeichnis zur Speicherung von Bildern"]
["Unterordner Dokumente","Dokumente","Unterordner im Projektverzeichnis zur Speicherung von Dokumenten"]

{"sheet":"Playground","index":5,"n_rows":0,"n_cols":0,"rows_kept":0,"cut":false,"hidden":false,"merged":[[10,0,10,2]]}

{"sheet":"Template","index":6,"n_rows":1,"n_cols":1,"rows_kept":1,"cut":false,"hidden":false,"merged":[[0,0,1,3],[0,4,1,4],[0,5,1,9]]}
["Technischer Bericht"]

{"sheet":"Listen","index":7,"n_rows":8,"n_cols":15,"rows_kept":8,"cut":false,"hidden":false,"merged":[]}
["Kontaktarten",null,"Auftragsarten",null,"Auftragsstatus",null,"Haustypen",null,"Ansprechpartner/Funktionen",null,"Schadensarten",null,"Etagen",null,"Projekt"]
["Email",null,"Messung",null,"Neu",null,"Doppelhaus",null,"Anderer Kontakt",null,"Andere Ursache",null,"Dachgeschoss",null,"Aquaproject"]
["Mobiltelefon",null,"Sanierung",null,"in Bearbeitung",null,"Einfamilienhaus",null,"Eigentümer",null,"Rohrbruch",null,"Erdgeschoss",null,"Magic Deumidificazioni"]
["Telefon",null,"Trocknung",null,"Abgeschlossen",null,"Gewerbegebäude",null,"Hauswart",null,"Sturmschaden",null,"Obergeschoss"]
[null,null,null,null,"Abgerechnet",null,"Mehrfamilienhaus",null,"Mieter",null,null,null,"Untergeschoss"]
[null,null,null,null,null,null,"Nebengebäude",null,"Nachbar"]
[null,null,null,null,null,null,"Reihenhaus",null,"Vertretung des Eigentümers"]
[null,null,null,null,null,null,null,null,"Vertretung des Mieters"]